Garmaine Staff asked 2 years ago

I am trying to use vs code to create azure function and deploy it to azure. I followed the official documentation as described,

https://docs.microsoft.com/en-us/azure/azure-functions/functions-create-first-function-vs-code?pivots=programming-language-java.

did everything as described in this document but got the error on pressing F5 upon reaching the section 'Run the function locally'. I tried few things by searching on internet but none of them work. I noticed there is an open issue on official github account reported way back in 2017

https://github.com/Microsoft/function-demo-java-on-azure/issues/3

That makes me wonder is this problem still exist?

Already spent lots of time on this but couldn't make it to work. Any help is appreciated

          Environment:
          VS Code: v1.44.0
          jdk 11.0.3
          node v12.16.1
          maven v3.6.3

successfully installed the azure function core tools using the command, npm install -g azure-functions-core-tools@3

Here is complete error trace

INFO] --- azure-functions-maven-plugin:0.1.4:package (package-functions) @ azure-http-trigger-example ---
[INFO] ------------------------------------------------------------------------
[INFO] BUILD FAILURE
[INFO] ------------------------------------------------------------------------
[INFO] Total time:  18.933 s
[INFO] Finished at: 2020-04-10T17:28:19-04:00
[INFO] ------------------------------------------------------------------------
[ERROR] Failed to execute goal com.microsoft.azure:azure-functions-maven-plugin:0.1.4:package (package-functions) on project azure-http-trigger-example: Execution package-functions of goal com.microsoft.azure:azure-functions-maven-plugin:0.1.4:package failed: A required class was missing while executing com.microsoft.azure:azure-functions-maven-plugin:0.1.4:package: javax/xml/bind/JAXBException
[ERROR] -----------------------------------------------------
[ERROR] realm =    plugin>com.microsoft.azure:azure-functions-maven-plugin:0.1.4
[ERROR] strategy = org.codehaus.plexus.classworlds.strategy.SelfFirstStrategy
[ERROR] urls[0] = file:/C:/maven/repository/com/microsoft/azure/azure-functions-maven-plugin/0.1.4/azure-functions-maven-plugin-0.1.4.jar
[ERROR] urls[1] = file:/C:/maven/repository/javax/enterprise/cdi-api/1.0/cdi-api-1.0.jar
[ERROR] urls[2] = file:/C:/maven/repository/org/eclipse/sisu/org.eclipse.sisu.inject/0.3.0/org.eclipse.sisu.inject-0.3.0.jar
[ERROR] urls[3] = file:/C:/maven/repository/org/apache/maven/maven-builder-support/3.3.3/maven-builder-support-3.3.3.jar
[ERROR] urls[4] = file:/C:/maven/repository/org/eclipse/aether/aether-util/1.0.2.v20150114/aether-util-1.0.2.v20150114.jar
[ERROR] urls[5] = file:/C:/maven/repository/org/sonatype/sisu/sisu-guice/3.2.5/sisu-guice-3.2.5-no_aop.jar
[ERROR] urls[6] = file:/C:/maven/repository/aopalliance/aopalliance/1.0/aopalliance-1.0.jar
[ERROR] urls[7] = file:/C:/maven/repository/org/codehaus/plexus/plexus-interpolation/1.21/plexus-interpolation-1.21.jar
[ERROR] urls[8] = file:/C:/maven/repository/org/codehaus/plexus/plexus-component-annotations/1.5.5/plexus-component-annotations-1.5.5.jar
[ERROR] urls[9] = file:/C:/maven/repository/org/sonatype/plexus/plexus-sec-dispatcher/1.3/plexus-sec-dispatcher-1.3.jar
[ERROR] urls[10] = file:/C:/maven/repository/org/sonatype/plexus/plexus-cipher/1.4/plexus-cipher-1.4.jar
[ERROR] urls[11] = file:/C:/maven/repository/org/codehaus/plexus/plexus-utils/3.0.20/plexus-utils-3.0.20.jar
[ERROR] urls[12] = file:/C:/maven/repository/com/microsoft/azure/azure-maven-plugin-lib/0.1.4/azure-maven-plugin-lib-0.1.4.jar
[ERROR] urls[13] = file:/C:/maven/repository/org/apache/maven/shared/maven-filtering/3.0.0/maven-filtering-3.0.0.jar
[ERROR] urls[14] = file:/C:/maven/repository/org/apache/maven/shared/maven-shared-utils/3.0.0/maven-shared-utils-3.0.0.jar
[ERROR] urls[15] = file:/C:/maven/repository/com/google/code/findbugs/jsr305/2.0.1/jsr305-2.0.1.jar
[ERROR] urls[16] = file:/C:/maven/repository/org/sonatype/plexus/plexus-build-api/0.0.7/plexus-build-api-0.0.7.jar
[ERROR] urls[17] = file:/C:/maven/repository/com/microsoft/azure/azure/1.2.1/azure-1.2.1.jar
[ERROR] urls[18] = file:/C:/maven/repository/com/microsoft/azure/azure-mgmt-resources/1.2.1/azure-mgmt-resources-1.2.1.jar
[ERROR] urls[19] = file:/C:/maven/repository/org/slf4j/slf4j-simple/1.7.5/slf4j-simple-1.7.5.jar
[ERROR] urls[20] = file:/C:/maven/repository/io/reactivex/rxjava/1.2.4/rxjava-1.2.4.jar
[ERROR] urls[21] = file:/C:/maven/repository/org/apache/httpcomponents/httpcore/4.4.5/httpcore-4.4.5.jar
[ERROR] urls[22] = file:/C:/maven/repository/com/microsoft/azure/azure-mgmt-storage/1.2.1/azure-mgmt-storage-1.2.1.jar
[ERROR] urls[23] = file:/C:/maven/repository/com/microsoft/azure/azure-mgmt-network/1.2.1/azure-mgmt-network-1.2.1.jar
[ERROR] urls[24] = file:/C:/maven/repository/com/microsoft/azure/azure-mgmt-compute/1.2.1/azure-mgmt-compute-1.2.1.jar
[ERROR] urls[25] = file:/C:/maven/repository/com/microsoft/azure/azure-mgmt-graph-rbac/1.2.1/azure-mgmt-graph-rbac-1.2.1.jar
[ERROR] urls[26] = file:/C:/maven/repository/com/microsoft/azure/azure-mgmt-keyvault/1.2.1/azure-mgmt-keyvault-1.2.1.jar
[ERROR] urls[27] = file:/C:/maven/repository/com/microsoft/azure/azure-mgmt-batch/1.2.1/azure-mgmt-batch-1.2.1.jar
[ERROR] urls[28] = file:/C:/maven/repository/com/microsoft/azure/azure-mgmt-trafficmanager/1.2.1/azure-mgmt-trafficmanager-1.2.1.jar
[ERROR] urls[29] = file:/C:/maven/repository/com/microsoft/azure/azure-mgmt-dns/1.2.1/azure-mgmt-dns-1.2.1.jar
[ERROR] urls[30] = file:/C:/maven/repository/com/microsoft/azure/azure-mgmt-redis/1.2.1/azure-mgmt-redis-1.2.1.jar
[ERROR] urls[31] = file:/C:/maven/repository/com/microsoft/azure/azure-mgmt-appservice/1.2.1/azure-mgmt-appservice-1.2.1.jar
[ERROR] urls[32] = file:/C:/maven/repository/com/microsoft/azure/azure-mgmt-cdn/1.2.1/azure-mgmt-cdn-1.2.1.jar
[ERROR] urls[33] = file:/C:/maven/repository/com/microsoft/azure/azure-mgmt-sql/1.2.1/azure-mgmt-sql-1.2.1.jar
[ERROR] urls[34] = file:/C:/maven/repository/com/microsoft/azure/azure-mgmt-containerregistry/1.2.1/azure-mgmt-containerregistry-1.2.1.jar
[ERROR] urls[35] = file:/C:/maven/repository/com/microsoft/azure/azure-mgmt-cosmosdb/1.2.1/azure-mgmt-cosmosdb-1.2.1.jar
[ERROR] urls[36] = file:/C:/maven/repository/com/microsoft/azure/azure-mgmt-search/1.2.1/azure-mgmt-search-1.2.1.jar
[ERROR] urls[37] = file:/C:/maven/repository/com/microsoft/azure/azure-mgmt-servicebus/1.2.1/azure-mgmt-servicebus-1.2.1.jar
[ERROR] urls[38] = file:/C:/maven/repository/joda-time/joda-time/2.1/joda-time-2.1.jar
[ERROR] urls[39] = file:/C:/maven/repository/com/microsoft/azure/azure-client-runtime/1.1.0/azure-client-runtime-1.1.0.jar
[ERROR] urls[40] = file:/C:/maven/repository/com/microsoft/rest/client-runtime/1.1.0/client-runtime-1.1.0.jar
[ERROR] urls[41] = file:/C:/maven/repository/com/squareup/retrofit2/retrofit/2.1.0/retrofit-2.1.0.jar
[ERROR] urls[42] = file:/C:/maven/repository/com/squareup/okhttp3/okhttp/3.3.1/okhttp-3.3.1.jar
[ERROR] urls[43] = file:/C:/maven/repository/com/squareup/okio/okio/1.8.0/okio-1.8.0.jar
[ERROR] urls[44] = file:/C:/maven/repository/com/squareup/okhttp3/logging-interceptor/3.3.1/logging-interceptor-3.3.1.jar
[ERROR] urls[45] = file:/C:/maven/repository/com/squareup/okhttp3/okhttp-urlconnection/3.3.1/okhttp-urlconnection-3.3.1.jar
[ERROR] urls[46] = file:/C:/maven/repository/com/squareup/retrofit2/converter-jackson/2.1.0/converter-jackson-2.1.0.jar
[ERROR] urls[47] = file:/C:/maven/repository/com/fasterxml/jackson/core/jackson-databind/2.7.2/jackson-databind-2.7.2.jar
[ERROR] urls[48] = file:/C:/maven/repository/com/fasterxml/jackson/datatype/jackson-datatype-joda/2.7.2/jackson-datatype-joda-2.7.2.jar
[ERROR] urls[49] = file:/C:/maven/repository/com/fasterxml/jackson/core/jackson-annotations/2.7.0/jackson-annotations-2.7.0.jar
[ERROR] urls[50] = file:/C:/maven/repository/com/squareup/retrofit2/adapter-rxjava/2.1.0/adapter-rxjava-2.1.0.jar
[ERROR] urls[51] = file:/C:/maven/repository/com/microsoft/azure/azure-client-authentication/1.1.0/azure-client-authentication-1.1.0.jar
[ERROR] urls[52] = file:/C:/maven/repository/com/microsoft/azure/adal4j/1.1.2/adal4j-1.1.2.jar
[ERROR] urls[53] = file:/C:/maven/repository/com/nimbusds/oauth2-oidc-sdk/4.5/oauth2-oidc-sdk-4.5.jar
[ERROR] urls[54] = file:/C:/maven/repository/javax/mail/mail/1.4.7/mail-1.4.7.jar
[ERROR] urls[55] = file:/C:/maven/repository/javax/activation/activation/1.1/activation-1.1.jar
[ERROR] urls[56] = file:/C:/maven/repository/net/jcip/jcip-annotations/1.0/jcip-annotations-1.0.jar
[ERROR] urls[57] = file:/C:/maven/repository/net/minidev/json-smart/1.1.1/json-smart-1.1.1.jar
[ERROR] urls[58] = file:/C:/maven/repository/com/nimbusds/lang-tag/1.4/lang-tag-1.4.jar
[ERROR] urls[59] = file:/C:/maven/repository/com/nimbusds/nimbus-jose-jwt/3.1.2/nimbus-jose-jwt-3.1.2.jar
[ERROR] urls[60] = file:/C:/maven/repository/org/bouncycastle/bcprov-jdk15on/1.51/bcprov-jdk15on-1.51.jar
[ERROR] urls[61] = file:/C:/maven/repository/com/google/code/gson/gson/2.2.4/gson-2.2.4.jar
[ERROR] urls[62] = file:/C:/maven/repository/commons-codec/commons-codec/1.10/commons-codec-1.10.jar
[ERROR] urls[63] = file:/C:/maven/repository/com/microsoft/azure/azure-annotations/1.2.0/azure-annotations-1.2.0.jar
[ERROR] urls[64] = file:/C:/maven/repository/com/microsoft/azure/applicationinsights-core/1.0.9/applicationinsights-core-1.0.9.jar
[ERROR] urls[65] = file:/C:/maven/repository/eu/infomas/annotation-detector/3.0.4/annotation-detector-3.0.4.jar
[ERROR] urls[66] = file:/C:/maven/repository/commons-io/commons-io/2.4/commons-io-2.4.jar
[ERROR] urls[67] = file:/C:/maven/repository/org/apache/httpcomponents/httpclient/4.5.3/httpclient-4.5.3.jar
[ERROR] urls[68] = file:/C:/maven/repository/commons-logging/commons-logging/1.2/commons-logging-1.2.jar
[ERROR] urls[69] = file:/C:/maven/repository/commons-net/commons-net/3.6/commons-net-3.6.jar
[ERROR] urls[70] = file:/C:/maven/repository/com/microsoft/azure/azure-functions-java-core/1.0.0-beta-1/azure-functions-java-core-1.0.0-beta-1.jar
[ERROR] urls[71] = file:/C:/maven/repository/org/reflections/reflections/0.9.11/reflections-0.9.11.jar
[ERROR] urls[72] = file:/C:/maven/repository/com/google/guava/guava/20.0/guava-20.0.jar
[ERROR] urls[73] = file:/C:/maven/repository/org/javassist/javassist/3.21.0-GA/javassist-3.21.0-GA.jar
[ERROR] urls[74] = file:/C:/maven/repository/com/microsoft/azure/azure-storage/5.4.0/azure-storage-5.4.0.jar
[ERROR] urls[75] = file:/C:/maven/repository/com/fasterxml/jackson/core/jackson-core/2.6.0/jackson-core-2.6.0.jar
[ERROR] urls[76] = file:/C:/maven/repository/org/apache/commons/commons-lang3/3.4/commons-lang3-3.4.jar
[ERROR] urls[77] = file:/C:/maven/repository/com/microsoft/azure/azure-keyvault-core/0.8.0/azure-keyvault-core-0.8.0.jar
[ERROR] urls[78] = file:/C:/maven/repository/org/zeroturnaround/zt-zip/1.12/zt-zip-1.12.jar
[ERROR] urls[79] = file:/C:/maven/repository/junit/junit/4.12/junit-4.12.jar
[ERROR] urls[80] = file:/C:/maven/repository/org/hamcrest/hamcrest-core/1.3/hamcrest-core-1.3.jar
[ERROR] Number of foreign imports: 1
[ERROR] import: Entry[import  from realm ClassRealm[maven.api, parent: null]]
[ERROR]
[ERROR] -----------------------------------------------------
[ERROR] : javax.xml.bind.JAXBException
[ERROR] -> [Help 1]
[ERROR]
[ERROR] To see the full stack trace of the errors, re-run Maven with the -e switch.
[ERROR] Re-run Maven using the -X switch to enable full debug logging.
[ERROR]
[ERROR] For more information about the errors and possible solutions, please read the following articles:
[ERROR] [Help 1] http://cwiki.apache.org/confluence/display/MAVEN/PluginContainerException
The terminal process terminated with exit code: 1

Terminal will be reused by tasks, press any key to close it.